{"text_format":"1","workbook":"xlsx","n_sheets":3,"sheets":["Data","Pivots","Dashboard"],"not_rendered":{"charts":4,"images":3,"macros":1,"external_links":0,"defined_names":8,"comments":0,"pivot_tables":5},"unopened":[],"bounds":{"document_bytes":16777216,"sheet_cells":100000,"rows_first":2000,"rows_last":500,"rows_between":2000,"halvings":0,"cell_chars":16384,"cell_head_chars":4096},"cells_cut":0,"cells_raw":0,"read":"whole","date_system":"1900"}

{"sheet":"Data","index":0,"n_rows":504,"n_cols":15,"rows_kept":504,"cut":false,"hidden":true,"merged":[]}
["CustID","Customer","Industry","Region","Product","Estimated Revenue ($000)","Actual Revenue ($000)","Quarter","Year","Sales Rep","YQ","IYQ","RYQ","SYQ","PYQ"]
[{"$f":"IF(LEN(B2)=9,RIGHT(B2,1),IF(LEN(B2)=10,RIGHT(B2,2),RIGHT(B2,3)))","v":"1"},"Customer1","Consumer Goods","Europe","Product1",250,255,"Q4",2006,"Fritz Klein","2006Q4","Consumer Goods2006Q4","Europe2006Q4","Fritz Klein2006Q4","Product12006Q4"]
[{"$f":"IF(LEN(B3)=9,RIGHT(B3,1),IF(LEN(B3)=10,RIGHT(B3,2),RIGHT(B3,3)))","v":"2"},"Customer2","Consumer Goods","North America","Product2",200,319,"Q3",2008,"Porter Le","2008Q3","Consumer Goods2008Q3","North America2008Q3","Porter Le2008Q3","Product22008Q3"]
["3","Customer3","Services","Asia Pacific","Product1",600,123,"Q3",2006,"Oren Chase","2006Q3","Services2006Q3","Asia Pacific2006Q3","Oren Chase2006Q3","Product12006Q3"]
["4","Customer4","Finance","North America","Product2",400,272,"Q4",2008,"Porter Le","2008Q4","Finance2008Q4","North America2008Q4","Porter Le2008Q4","Product22008Q4"]
["5","Customer5","Consumer Goods","Europe","Product3",200,30,"Q2",2006,"Fritz Klein","2006Q2","Consumer Goods2006Q2","Europe2006Q2","Fritz Klein2006Q2","Product32006Q2"]
["6","Customer6","Services","North America","Product4",550,537,"Q1",2007,"Porter Le","2007Q1","Services2007Q1","North America2007Q1","Porter Le2007Q1","Product42007Q1"]
["7","Customer7","Technology","North America","Product4",650,89,"Q4",2005,"Porter Le","2005Q4","Technology2005Q4","North America2005Q4","Porter Le2005Q4","Product42005Q4"]
["8","Customer8","Consumer Goods","Europe","Product2",200,249,"Q4",2003,"Fritz Klein","2003Q4","Consumer Goods2003Q4","Europe2003Q4","Fritz Klein2003Q4","Product22003Q4"]
["9","Customer9","Healthcare","Asia Pacific","Product2",450,268,"Q4",2005,"Oren Chase","2005Q4","Healthcare2005Q4","Asia Pacific2005Q4","Oren Chase2005Q4","Product22005Q4"]
["10","Customer10","Consumer Goods","Europe","Product2",250,601,"Q2",2005,"Fritz Klein","2005Q2","Consumer Goods2005Q2","Europe2005Q2","Fritz Klein2005Q2","Product22005Q2"]
["11","Customer11","Utilities","South America","Product2",700,475,"Q4",2007,"Nasim Hanson","2007Q4","Utilities2007Q4","South America2007Q4","Nasim Hanson2007Q4","Product22007Q4"]
["12","Customer12","Technology","Europe","Product4",650,378,"Q3",2006,"Fritz Klein","2006Q3","Technology2006Q3","Europe2006Q3","Fritz Klein2006Q3","Product42006Q3"]
["13","Customer13","Materials","Europe","Product3",150,286,"Q4",2006,"Fritz Klein","2006Q4","Materials2006Q4","Europe2006Q4","Fritz Klein2006Q4","Product32006Q4"]
["14","Customer14","Materials","Middle East","Product4",150,158,"Q3",2006,"Bradley Valenzuela","2006Q3","Materials2006Q3","Middle East2006Q3","Bradley Valenzuela2006Q3","Product42006Q3"]
["15","Customer15","Materials","South America","Product3",100,390,"Q3",2004,"Nasim Hanson","2004Q3","Materials2004Q3","South America2004Q3","Nasim Hanson2004Q3","Product32004Q3"]
["16","Customer16","Consumer Goods","North America","Product1",300,291,"Q3",2004,"Porter Le","2004Q3","Consumer Goods2004Q3","North America2004Q3","Porter Le2004Q3","Product12004Q3"]
["17","Customer17","Materials","North America","Product4",100,764,"Q3",2008,"Porter Le","2008Q3","Materials2008Q3","North America2008Q3","Porter Le2008Q3","Product42008Q3"]
["18","Customer18","Finance","North America","Product2",400,415,"Q2",2007,"Porter Le","2007Q2","Finance2007Q2","North America2007Q2","Porter Le2007Q2","Product22007Q2"]
["19","Customer19","Services","Asia Pacific","Product2",600,702,"Q2",2005,"Oren Chase","2005Q2","Services2005Q2","Asia Pacific2005Q2","Oren Chase2005Q2","Product22005Q2"]
["20","Customer20","Services","North America","Product3",550,941,"Q2",2006,"Porter Le","2006Q2","Services2006Q2","North America2006Q2","Porter Le2006Q2","Product32006Q2"]
["21","Customer21","Utilities","South America","Product4",700,53,"Q1",2005,"Nasim Hanson","2005Q1","Utilities2005Q1","South America2005Q1","Nasim Hanson2005Q1","Product42005Q1"]
["22","Customer22","Finance","Europe","Product2",400,151,"Q3",2007,"Fritz Klein","2007Q3","Finance2007Q3","Europe2007Q3","Fritz Klein2007Q3","Product22007Q3"]
["23","Customer23","Healthcare","North America","Product4",500,953,"Q2",2003,"Porter Le","2003Q2","Healthcare2003Q2","North America2003Q2","Porter Le2003Q2","Product42003Q2"]
["24","Customer24","Technology","Asia Pacific","Product1",650,105,"Q2",2004,"Oren Chase","2004Q2","Technology2004Q2","Asia Pacific2004Q2","Oren Chase2004Q2","Product12004Q2"]
["25","Customer25","Technology","Europe","Entera CRM",650,87,"Q1",2006,"Fritz Klein","2006Q1","Technology2006Q1","Europe2006Q1","Fritz Klein2006Q1","Entera CRM2006Q1"]
["26","Customer26","Consumer Goods","Europe","Product1",200,987,"Q4",2008,"Fritz Klein","2008Q4","Consumer Goods2008Q4","Europe2008Q4","Fritz Klein2008Q4","Product12008Q4"]
["27","Customer27","Utilities","North America","Product4",700,81,"Q2",2007,"Porter Le","2007Q2","Utilities2007Q2","North America2007Q2","Porter Le2007Q2","Product42007Q2"]
["28","Customer28","Materials","Middle East","Product4",150,675,"Q1",2007,"Bradley Valenzuela","2007Q1","Materials2007Q1","Middle East2007Q1","Bradley Valenzuela2007Q1","Product42007Q1"]
["29","Customer29","Consumer Goods","Europe","Product2",250,616,"Q4",2007,"Fritz Klein","2007Q4","Consumer Goods2007Q4","Europe2007Q4","Fritz Klein2007Q4","Product22007Q4"]
["30","Customer30","Industrial Goods","Asia Pacific","Product3",550,856,"Q3",2006,"Oren Chase","2006Q3","Industrial Goods2006Q3","Asia Pacific2006Q3","Oren Chase2006Q3","Product32006Q3"]
["31","Customer31","Finance","Europe","Product1",400,617,"Q4",2006,"Fritz Klein","2006Q4","Finance2006Q4","Europe2006Q4","Fritz Klein2006Q4","Product12006Q4"]
["32","Customer32","Consumer Goods","Europe","Product1",300,852,"Q2",2008,"Fritz Klein","2008Q2","Consumer Goods2008Q2","Europe2008Q2","Fritz Klein2008Q2","Product12008Q2"]
["33","Customer33","Services","North America","Product2",600,765,"Q4",2007,"Porter Le","2007Q4","Services2007Q4","North America2007Q4","Porter Le2007Q4","Product22007Q4"]
["34","Customer34","Finance","North America","Entera CRM",300,958,"Q3",2004,"Porter Le","2004Q3","Finance2004Q3","North America2004Q3","Porter Le2004Q3","Entera CRM2004Q3"]
["35","Customer35","Finance","Europe","Product3",400,300,"Q2",2007,"Fritz Klein","2007Q2","Finance2007Q2","Europe2007Q2","Fritz Klein2007Q2","Product32007Q2"]
["36","Customer36","Technology","Europe","Entera CRM",650,84,"Q2",2008,"Fritz Klein","2008Q2","Technology2008Q2","Europe2008Q2","Fritz Klein2008Q2","Entera CRM2008Q2"]
["37","Customer37","Materials","Europe","Product3",150,83,"Q2",2008,"Fritz Klein","2008Q2","Materials2008Q2","Europe2008Q2","Fritz Klein2008Q2","Product32008Q2"]
["38","Customer38","Services","North America","Product2",600,756,"Q1",2007,"Porter Le","2007Q1","Services2007Q1","North America2007Q1","Porter Le2007Q1","Product22007Q1"]
["39","Customer39","Materials","Europe","Product4",100,887,"Q3",2007,"Fritz Klein","2007Q3","Materials2007Q3","Europe2007Q3","Fritz Klein2007Q3","Product42007Q3"]
["40","Customer40","Consumer Goods","Europe","Entera CRM",200,188,"Q3",2003,"Fritz Klein","2003Q3","Consumer Goods2003Q3","Europe2003Q3","Fritz Klein2003Q3","Entera CRM2003Q3"]
["41","Customer41","Materials","Asia Pacific","Product1",150,598,"Q3",2006,"Oren Chase","2006Q3","Materials2006Q3","Asia Pacific2006Q3","Oren Chase2006Q3","Product12006Q3"]
["42","Customer42","Materials","Middle East","Product1",150,64,"Q3",2007,"Bradley Valenzuela","2007Q3","Materials2007Q3","Middle East2007Q3","Bradley Valenzuela2007Q3","Product12007Q3"]
["43","Customer43","Utilities","South America","Product4",700,534,"Q4",2005,"Nasim Hanson","2005Q4","Utilities2005Q4","South America2005Q4","Nasim Hanson2005Q4","Product42005Q4"]
["44","Customer44","Materials","North America","Product4",100,160,"Q3",2003,"Porter Le","2003Q3","Materials2003Q3","North America2003Q3","Porter Le2003Q3","Product42003Q3"]
["45","Customer45","Services","North America","Product3",600,884,"Q1",2008,"Porter Le","2008Q1","Services2008Q1","North America2008Q1","Porter Le2008Q1","Product32008Q1"]
["46","Customer46","Materials","North America","Product1",100,828,"Q3",2004,"Porter Le","2004Q3","Materials2004Q3","North America2004Q3","Porter Le2004Q3","Product12004Q3"]
["47","Customer47","Technology","Europe","Entera CRM",650,81,"Q1",2003,"Fritz Klein","2003Q1","Technology2003Q1","Europe2003Q1","Fritz Klein2003Q1","Entera CRM2003Q1"]
["48","Customer48","Services","North America","Product2",600,835,"Q1",2008,"Porter Le","2008Q1","Services2008Q1","North America2008Q1","Porter Le2008Q1","Product22008Q1"]
["49","Customer49","Consumer Goods","Europe","Product1",250,810,"Q2",2004,"Fritz Klein","2004Q2","Consumer Goods2004Q2","Europe2004Q2","Fritz Klein2004Q2","Product12004Q2"]
["50","Customer50","Healthcare","Europe","Product1",500,536,"Q2",2006,"Fritz Klein","2006Q2","Healthcare2006Q2","Europe2006Q2","Fritz Klein2006Q2","Product12006Q2"]
["51","Customer51","Consumer Goods","Europe","Product3",200,476,"Q2",2005,"Fritz Klein","2005Q2","Consumer Goods2005Q2","Europe2005Q2","Fritz Klein2005Q2","Product32005Q2"]
["52","Customer52","Materials","South America","Product1",100,623,"Q2",2006,"Nasim Hanson","2006Q2","Materials2006Q2","South America2006Q2","Nasim Hanson2006Q2","Product12006Q2"]
["53","Customer53","Finance","Asia Pacific","Entera CRM",450,456,"Q3",2003,"Oren Chase","2003Q3","Finance2003Q3","Asia Pacific2003Q3","Oren Chase2003Q3","Entera CRM2003Q3"]
["54","Customer54","Finance","Europe","Product3",400,450,"Q1",2005,"Fritz Klein","2005Q1","Finance2005Q1","Europe2005Q1","Fritz Klein2005Q1","Product32005Q1"]
["55","Customer55","Technology","Europe","Product3",650,830,"Q3",2005,"Fritz Klein","2005Q3","Technology2005Q3","Europe2005Q3","Fritz Klein2005Q3","Product32005Q3"]
["56","Customer56","Finance","North America","Product4",300,252,"Q1",2005,"Porter Le","2005Q1","Finance2005Q1","North America2005Q1","Porter Le2005Q1","Product42005Q1"]
["57","Customer57","Finance","North America","Product4",350,863,"Q4",2006,"Porter Le","2006Q4","Finance2006Q4","North America2006Q4","Porter Le2006Q4","Product42006Q4"]
["58","Customer58","Technology","Asia Pacific","Product4",650,769,"Q2",2003,"Oren Chase","2003Q2","Technology2003Q2","Asia Pacific2003Q2","Oren Chase2003Q2","Product42003Q2"]
["59","Customer59","Consumer Goods","North America","Product3",300,585,"Q2",2008,"Porter Le","2008Q2","Consumer Goods2008Q2","North America2008Q2","Porter Le2008Q2","Product32008Q2"]
["60","Customer60","Consumer Goods","Europe","Product2",250,436,"Q2",2006,"Fritz Klein","2006Q2","Consumer Goods2006Q2","Europe2006Q2","Fritz Klein2006Q2","Product22006Q2"]
["61","Customer61","Healthcare","South America","Product3",450,161,"Q1",2008,"Nasim Hanson","2008Q1","Healthcare2008Q1","South America2008Q1","Nasim Hanson2008Q1","Product32008Q1"]
["62","Customer62","Consumer Goods","Europe","Product3",300,801,"Q2",2006,"Fritz Klein","2006Q2","Consumer Goods2006Q2","Europe2006Q2","Fritz Klein2006Q2","Product32006Q2"]
["63","Customer63","Finance","Europe","Entera CRM",400,156,"Q3",2003,"Fritz Klein","2003Q3","Finance2003Q3","Europe2003Q3","Fritz Klein2003Q3","Entera CRM2003Q3"]
["64","Customer64","Finance","Europe","Product3",400,32,"Q4",2007,"Fritz Klein","2007Q4","Finance2007Q4","Europe2007Q4","Fritz Klein2007Q4","Product32007Q4"]
["65","Customer65","Industrial Goods","Asia Pacific","Product3",500,122,"Q3",2003,"Oren Chase","2003Q3","Industrial Goods2003Q3","Asia Pacific2003Q3","Oren Chase2003Q3","Product32003Q3"]
[{"$f":"IF(LEN(B67)=9,RIGHT(B67,1),IF(LEN(B67)=10,RIGHT(B67,2),RIGHT(B67,3)))","v":"66"},"Customer66","Consumer Goods","Asia Pacific","Product3",250,732,"Q4",2006,"Oren Chase","2006Q4","Consumer Goods2006Q4","Asia Pacific2006Q4","Oren Chase2006Q4","Product32006Q4"]
["67","Customer67","Consumer Goods","Europe","Entera CRM",200,344,"Q4",2006,"Fritz Klein","2006Q4","Consumer Goods2006Q4","Europe2006Q4","Fritz Klein2006Q4","Entera CRM2006Q4"]
["68","Customer68","Utilities","North America","Product1",700,974,"Q1",2006,"Porter Le","2006Q1","Utilities2006Q1","North America2006Q1","Porter Le2006Q1","Product12006Q1"]
["69","Customer69","Healthcare","Europe","Entera CRM",500,929,"Q1",2003,"Fritz Klein","2003Q1","Healthcare2003Q1","Europe2003Q1","Fritz Klein2003Q1","Entera CRM2003Q1"]
["70","Customer70","Services","North America","Product1",600,389,"Q3",2004,"Porter Le","2004Q3","Services2004Q3","North America2004Q3","Porter Le2004Q3","Product12004Q3"]
["71","Customer71","Finance","North America","Product3",350,409,"Q2",2004,"Porter Le","2004Q2","Finance2004Q2","North America2004Q2","Porter Le2004Q2","Product32004Q2"]
["72","Customer72","Consumer Goods","Europe","Entera CRM",250,907,"Q1",2003,"Fritz Klein","2003Q1","Consumer Goods2003Q1","Europe2003Q1","Fritz Klein2003Q1","Entera CRM2003Q1"]
["73","Customer73","Materials","South America","Product2",100,928,"Q2",2005,"Nasim Hanson","2005Q2","Materials2005Q2","South America2005Q2","Nasim Hanson2005Q2","Product22005Q2"]
["74","Customer74","Industrial Goods","Asia Pacific","Product2",550,928,"Q3",2003,"Oren Chase","2003Q3","Industrial Goods2003Q3","Asia Pacific2003Q3","Oren Chase2003Q3","Product22003Q3"]
["75","Customer75","Materials","North America","Product2",100,271,"Q4",2007,"Porter Le","2007Q4","Materials2007Q4","North America2007Q4","Porter Le2007Q4","Product22007Q4"]
["76","Customer76","Healthcare","North America","Product3",500,468,"Q1",2007,"Porter Le","2007Q1","Healthcare2007Q1","North America2007Q1","Porter Le2007Q1","Product32007Q1"]
["77","Customer77","Finance","North America","Entera CRM",350,913,"Q3",2005,"Porter Le","2005Q3","Finance2005Q3","North America2005Q3","Porter Le2005Q3","Entera CRM2005Q3"]
["78","Customer78","Utilities","South America","Product1",700,438,"Q3",2005,"Nasim Hanson","2005Q3","Utilities2005Q3","South America2005Q3","Nasim Hanson2005Q3","Product12005Q3"]
["79","Customer79","Services","North America","Entera CRM",600,871,"Q4",2007,"Porter Le","2007Q4","Services2007Q4","North America2007Q4","Porter Le2007Q4","Entera CRM2007Q4"]
{"$rows_left_out":425}
{"sheet":"Pivots","index":1,"n_rows":48,"n_cols":7,"rows_kept":48,"cut":false,"hidden":true,"merged":[]}
["Row Labels","Estimated Revenue ($000) ","Actual Revenue ($000) "]
["Asia Pacific",46300,58445]
["Europe",46000,71443]
["Middle East",2000,6485]
["North America",88050,109520]
["South America",15750,22864]
["Grand Total",198100,268757]
[]
["Row Labels","Estimated Revenue ($000) ","Actual Revenue ($000) "]
["Entera CRM",40650,52628]
["Product1",41900,58392]
["Product2",35550,47017]
["Product3",39350,51843]
["Product4",40650,58877]
["Grand Total",198100,268757]
[]
["Row Labels","Estimated Revenue ($000) ","Actual Revenue ($000) ",null,"Row Labels","Sum of Estimated Revenue ($000)","Sum of Actual Revenue ($000)"]
["Bradley Valenzuela",2000,6485,null,2003,41650,57829]
["Fritz Klein",46000,71443,null,"Q1",9700,16584]
["Nasim Hanson",15750,22864,null,"Q2",9800,12395]
["Oren Chase",46300,58445,null,"Q3",10350,15294]
["Porter Le",88050,109520,null,"Q4",11800,13556]
["Grand Total",198100,268757,null,2004,24750,33859]
[null,null,null,null,"Q1",3500,4055]
["Row Labels","Sum of Actual Revenue ($000)",null,null,"Q2",7100,9726]
["Consumer Goods",63860,null,null,"Q3",8650,10724]
["Finance",52158,null,null,"Q4",5500,9354]
["Healthcare",27671,null,null,2005,38000,45599]
["Industrial Goods",7041,null,null,"Q1",6050,8015]
["Materials",41329,null,null,"Q2",9650,11882]
["Services",37038,null,null,"Q3",8750,11316]
["Technology",24873,null,null,"Q4",13550,14386]
["Utilities",14787,null,null,2006,36350,48100]
["Grand Total",268757,null,null,"Q1",7250,9938]
[null,null,null,null,"Q2",8650,12644]
[null,null,null,null,"Q3",8350,10001]
[null,null,null,null,"Q4",12100,15517]
[null,null,null,null,2007,32550,42613]
[null,null,null,null,"Q1",8800,10886]
[null,null,null,null,"Q2",10750,14701]
[null,null,null,null,"Q3",8100,11127]
[null,null,null,null,"Q4",4900,5899]
[null,null,null,null,2008,24800,40757]
[null,null,null,null,"Q1",5700,9517]
[null,null,null,null,"Q2",6800,7617]
[null,null,null,null,"Q3",6250,12281]
[null,null,null,null,"Q4",6050,11342]
[null,null,null,null,"Grand Total",198100,268757]

{"sheet":"Dashboard","index":2,"n_rows":39,"n_cols":23,"rows_kept":39,"cut":false,"hidden":false,"merged":[[1,11,5,29],[2,6,3,9],[25,22,25,27],[8,6,8,11],[8,14,8,19],[8,22,8,27],[29,5,29,8],[29,10,29,13]]}
[]
[null,null,null,null,null,null,null,null,null,null,null,"Created by ExcelForum.com user: estratosphere"]
[null,null,null,null,null,null,"Financial Dashboard"]
[]
[null,null,null,null,null,null,"Fiscal Years 2003-2008"]
[]
[null,null,"Dashboard Filters:"]
[null,null,null,null,null,"REVENUE STATISTICS"]
[null,null,null,null,null,null,"By Region",null,null,null,null,null,null,null,"By Product",null,null,null,null,null,null,null,"By Sales Rep"]
[]
[]
[]
[]
[]
[]
[]
[]
[]
[]
[]
[]
[]
[]
[]
[]
[null,null,null,null,null,null,null,null,null,null,null,null,null,null,null,null,null,null,null,null,null,null,"Estimated vs Actual Revenue"]
[]
[null,null,null,null,null,"RANKINGS",null,null,null,null,null,null,null,null,null,null,"GENERAL INFORMATION"]
[]
[null,null,null,null,null,"Sales Rep (based on Revenue)",null,null,null,null,"Industry (based on Revenue)"]
[null,null,null,null,null,null,null,null,null,null,null,null,null,null,null,null,"Number of Customers",null,null,{"$f":"COUNTA(Data!A:A)-1","v":503}]
[null,null,null,null,null,{"$f":"RANK(I32,$I$32:$I$36,0)","v":1},"Porter Le",null,{"$f":"GETPIVOTDATA(\"Actual Revenue ($000) \",Pivots!$A$17,\"Sales Rep\",\"Porter Le\")","v":109520},null,{"$f":"RANK(N32,$N$32:$N$39,0)","v":1},"Consumer Goods",null,{"$f":"GETPIVOTDATA(\"Actual Revenue ($000)\",Pivots!$A$25,\"Industry\",\"Consumer Goods\")","v":63860}]
[null,null,null,null,null,{"$f":"RANK(I33,$I$32:$I$36,0)","v":2},"Fritz Klein",null,{"$f":"GETPIVOTDATA(\"Actual Revenue ($000) \",Pivots!$A$17,\"Sales Rep\",\"Fritz Klein\")","v":71443},null,{"$f":"RANK(N33,$N$32:$N$39,0)","v":2},"Finance",null,{"$f":"GETPIVOTDATA(\"Actual Revenue ($000)\",Pivots!$A$25,\"Industry\",\"Finance\")","v":52158},null,null,"Number of Products",null,null,{"$f":"SUM(IF(FREQUENCY(MATCH(Data!E2:E504,Data!E2:E504,0),MATCH(Data!E2:E504,Data!E2:E504,0))>0,1))","v":5}]
[null,null,null,null,null,{"$f":"RANK(I34,$I$32:$I$36,0)","v":3},"Oren Chase",null,{"$f":"GETPIVOTDATA(\"Actual Revenue ($000) \",Pivots!$A$17,\"Sales Rep\",\"Oren Chase\")","v":58445},null,{"$f":"RANK(N34,$N$32:$N$39,0)","v":3},"Materials",null,{"$f":"GETPIVOTDATA(\"Actual Revenue ($000)\",Pivots!$A$25,\"Industry\",\"Materials\")","v":41329}]
[null,null,null,null,null,{"$f":"RANK(I35,$I$32:$I$36,0)","v":4},"Nasim Hanson",null,{"$f":"GETPIVOTDATA(\"Actual Revenue ($000) \",Pivots!$A$17,\"Sales Rep\",\"Nasim Hanson\")","v":22864},null,{"$f":"RANK(N35,$N$32:$N$39,0)","v":4},"Services",null,{"$f":"GETPIVOTDATA(\"Actual Revenue ($000)\",Pivots!$A$25,\"Industry\",\"Services\")","v":37038},null,null,"Number of Industries",null,null,{"$f":"SUM(IF(FREQUENCY(MATCH(Data!C2:C504,Data!C2:C504,0),MATCH(Data!C2:C504,Data!C2:C504,0))>0,1))","v":8}]
[null,null,null,null,null,{"$f":"RANK(I36,$I$32:$I$36,0)","v":5},"Bradley Valenzuela",null,{"$f":"GETPIVOTDATA(\"Actual Revenue ($000) \",Pivots!$A$17,\"Sales Rep\",\"Bradley Valenzuela\")","v":6485},null,{"$f":"RANK(N36,$N$32:$N$39,0)","v":5},"Healthcare",null,{"$f":"GETPIVOTDATA(\"Actual Revenue ($000)\",Pivots!$A$25,\"Industry\",\"Healthcare\")","v":27671}]
[null,null,null,null,null,null,null,null,null,null,{"$f":"RANK(N37,$N$32:$N$39,0)","v":6},"Technology",null,{"$f":"GETPIVOTDATA(\"Actual Revenue ($000)\",Pivots!$A$25,\"Industry\",\"Technology\")","v":24873},null,null,"Number of Sales Reps",null,null,{"$f":"SUM(IF(FREQUENCY(MATCH(Data!J2:J504,Data!J2:J504,0),MATCH(Data!J2:J504,Data!J2:J504,0))>0,1))","v":5}]
[null,null,null,null,null,null,null,null,null,null,{"$f":"RANK(N38,$N$32:$N$39,0)","v":7},"Utilities",null,{"$f":"GETPIVOTDATA(\"Actual Revenue ($000)\",Pivots!$A$25,\"Industry\",\"Utilities\")","v":14787}]
[null,null,null,null,null,null,null,null,null,null,{"$f":"RANK(N39,$N$32:$N$39,0)","v":8},"Industrial Goods",null,{"$f":"GETPIVOTDATA(\"Actual Revenue ($000)\",Pivots!$A$25,\"Industry\",\"Industrial Goods\")","v":7041}]